Failed Test Brief Log By Test


CMakeLists.txt

OCI_Ubuntu_22_04_GCC16



[Details] The following tests FAILED:
[Details] Errors while running CTest
[Details] auto_run_tests.pl: ERROR: "CMakeLists.txt" returned with status 8


DevGuideExamples/DCPS/Messenger/CMakeLists.txt run_test.pl

OCI_Ubuntu_22_04_GCC16



[Details] ERROR: waiting for /var/lib/jenkins/workspace/OpenDDS_ACE8_Ubuntu_22_04_GCC16_x64_Debug/bin/DCPSInfoRepo IOR file
[Details] test FAILED (init_error finish_error).
[Details] ERROR: </var/lib/jenkins/workspace/OpenDDS_ACE8_Ubuntu_22_04_GCC16_x64_Debug/bin/DCPSInfoRepo> still running upon object destruction


DevGuideExamples/DCPS/Messenger/CMakeLists.txt run_test.pl --rtps

OCI_Ubuntu_22_04_GCC16



[Details] 2026-09-23 20:40:50: ERROR: publisher finished and returned 1
[Details] 2026-09-23 20:40:50: ERROR: subscriber finished and returned 1
[Details] test FAILED (success).


performance-tests/bench/run_test.pl ci-disco --show-worker-logs

OpenDDS_GHA_test_u24_acem_j_qt_ws_sec



[Details] ERROR: Total Undermatched Readers: 8, ERROR: Total Undermatched Writers: 8
[Details] ERROR: Only received 4 out of 20 expected worker reports!
[Details] 2026-09-29 19:00:58: ERROR: test_controller finished and returned 1
[Details] test FAILED (success).
[Details] auto_run_tests.pl: ERROR: "performance-tests/bench/run_test.pl ci-disco --show-worker-logs" returned with status 4


performance-tests/bench/run_test.pl ci-disco-long --show-worker-logs

OpenDDS_GHA_test_u24_acem_j_qt_ws_sec



[Details] ERROR: Total Undermatched Readers: 14, ERROR: Total Undermatched Writers: 14
[Details] ERROR: Only received 7 out of 20 expected worker reports!
[Details] 2026-09-29 19:02:14: ERROR: test_controller finished and returned 1
[Details] test FAILED (success).
[Details] auto_run_tests.pl: ERROR: "performance-tests/bench/run_test.pl ci-disco-long --show-worker-logs" returned with status 4


performance-tests/bench/run_test.pl ci-disco-repo --show-worker-logs

OpenDDS_GHA_test_u24_acem_j_qt_ws_sec



[Details] ERROR: Only received 0 out of 20 expected worker reports!
[Details] 2026-09-29 19:03:26: ERROR: test_controller finished and returned 1
[Details] test FAILED (success).
[Details] auto_run_tests.pl: ERROR: "performance-tests/bench/run_test.pl ci-disco-repo --show-worker-logs" returned with status 4


performance-tests/bench/run_test.pl ci-echo --show-worker-logs

OpenDDS_GHA_test_u24_acem_j_qt_ws_sec



[Details] Error: Timedout waiting for the scenario to complete
[Details] 2026-09-29 19:05:46: ERROR: test_controller finished and returned 1
[Details] ERROR: <node_controller/node_controller> exited with coredump from signal 11 : SEGV
[Details] Program terminated with signal SIGSEGV, Segmentation fault.
[Details] 2026-09-29 19:05:48: ERROR: node_controller terminated with a signal
[Details] test FAILED (success).
[Details] auto_run_tests.pl: ERROR: "performance-tests/bench/run_test.pl ci-echo --show-worker-logs" returned with status 4


performance-tests/bench/run_test.pl ci-echo-frag --show-worker-logs

OpenDDS_GHA_test_u24_acem_j_qt_ws_sec



[Details] Error: Timedout waiting for the scenario to complete
[Details] 2026-09-29 19:08:09: ERROR: test_controller finished and returned 1
[Details] ERROR: <node_controller/node_controller> exited with coredump from signal 11 : SEGV
[Details] Program terminated with signal SIGSEGV, Segmentation fault.
[Details] 2026-09-29 19:08:10: ERROR: node_controller terminated with a signal
[Details] test FAILED (success).
[Details] auto_run_tests.pl: ERROR: "performance-tests/bench/run_test.pl ci-echo-frag --show-worker-logs" returned with status 4


performance-tests/bench/run_test.pl ci-mixed --show-worker-logs

OpenDDS_GHA_test_u24_acem_j_qt_ws_sec



[Details] ERROR: Total Undermatched Readers: 17, ERROR: Total Undermatched Writers: 17
[Details] ERROR: Only received 6 out of 11 expected worker reports!
[Details] 2026-09-29 19:13:18: ERROR: test_controller finished and returned 1
[Details] test FAILED (success).
[Details] auto_run_tests.pl: ERROR: "performance-tests/bench/run_test.pl ci-mixed --show-worker-logs" returned with status 4


tests/DCPS/C++11/Messenger/CMakeLists.txt run_test.pl

OCI_Ubuntu_22_04_GCC16



[Details] ERROR: waiting for /var/lib/jenkins/workspace/OpenDDS_ACE8_Ubuntu_22_04_GCC16_x64_Debug/bin/DCPSInfoRepo IOR file
[Details] test FAILED (init_error finish_error).
[Details] ERROR: </var/lib/jenkins/workspace/OpenDDS_ACE8_Ubuntu_22_04_GCC16_x64_Debug/bin/DCPSInfoRepo> still running upon object destruction


tests/DCPS/Compiler/char_literals/CMakeLists.txt run_test.pl cpp11

OCI_Ubuntu_22_04_GCC16



[Details] 2026-09-23 20:41:36: ERROR: test finished and returned 1
[Details] test FAILED (success).


tests/DCPS/Compiler/idl_test3_main/run_test.pl

OpenDDS_GHA_test_u24_acem_j_qt_ws_sec



[Details] ERROR: <idl_test3> exited with coredump from signal 11 : SEGV
[Details] Program terminated with signal SIGSEGV, Segmentation fault.
[Details] ERROR: idl_test3 returned 255
[Details] auto_run_tests.pl: ERROR: "tests/DCPS/Compiler/idl_test3_main/run_test.pl" returned with status 1


tests/DCPS/Compiler/maps/CMakeLists.txt run_test.pl

OCI_Ubuntu_22_04_GCC16



[Details] 2026-09-23 20:41:37: ERROR: maps finished and returned 1
[Details] test FAILED (success).


tests/DCPS/Compiler/vread_vwrite/run_test.pl

OCI_Ubuntu_22_04_Clang22



[Details] [ FAILED ] VreadVwriteTest.DynamicSerializeTest (1 ms)
[Details] [ FAILED ] VreadVwriteTest.DynamicWithOptionalTest (0 ms)
[Details] [ FAILED ] 2 tests, listed below:
[Details] [ FAILED ] VreadVwriteTest.DynamicSerializeTest
[Details] [ FAILED ] VreadVwriteTest.DynamicWithOptionalTest
[Details] 2 FAILED TESTS
[Details] ERROR: VreadVwriteTest returned 1
[Details] test FAILED
[Details] auto_run_tests.pl: ERROR: "tests/DCPS/Compiler/vread_vwrite/run_test.pl" returned with status 1


tests/DCPS/Compiler/xcdr/CMakeLists.txt run_test.pl

OCI_Ubuntu_22_04_GCC16



[Details] 2026-09-23 20:41:36: ERROR: test finished and returned 1
[Details] test FAILED (success).


tests/DCPS/Compiler/xcdr/CMakeLists.txt run_test.pl --dynamic

OCI_Ubuntu_22_04_GCC16



[Details] 2026-09-23 20:41:36: ERROR: test finished and returned 1
[Details] test FAILED (success).


tests/DCPS/ContentFilteredTopic/run_test.pl rtps_disc dynamic

OCI_Ubuntu_22_04_Clang22



[Details] ERROR: ContentFilteredTopicTest timedout
[Details] 57 ./nptl/futex-internal.c: No such file or directory.
[Details] ERROR: test returned -1
[Details] auto_run_tests.pl: ERROR: "tests/DCPS/ContentFilteredTopic/run_test.pl rtps_disc dynamic" returned with status 1


tests/DCPS/ContentFilteredTopic/run_test.pl rtps_disc nopub dynamic

OCI_Ubuntu_22_04_Clang22



[Details] ERROR: ContentFilteredTopicTest timedout
[Details] 57 ./nptl/futex-internal.c: No such file or directory.
[Details] ERROR: test returned -1
[Details] auto_run_tests.pl: ERROR: "tests/DCPS/ContentFilteredTopic/run_test.pl rtps_disc nopub dynamic" returned with status 1


tests/DCPS/DynamicTypes/run_test.pl

OpenDDS_GHA_test_u24_acem_j_qt_ws_sec



[Details] ERROR: ./Recorder/xtypes_dynamic_recorder timedout
[Details] warning: 57 ./nptl/futex-internal.c: No such file or directory
[Details] 2026-09-29 18:55:33: ERROR: reader_my_struct_final_XCDR1 timedout
[Details] ERROR: <./Pub/xtypes_dynamic_pub> exited with coredump from signal 11 : SEGV
[Details] Program terminated with signal SIGSEGV, Segmentation fault.
[Details] 2026-09-29 18:55:34: ERROR: writer_my_struct_final_XCDR1 terminated with a signal
[Details] ERROR: my_struct_final_XCDR1 failed
[Details] ERROR: ./Recorder/xtypes_dynamic_recorder timedout
[Details] warning: 57 ./nptl/futex-internal.c: No such file or directory
[Details] 2026-09-29 18:55:52: ERROR: reader_my_struct_final_XCDR2 timedout
[Details] ERROR: <./Pub/xtypes_dynamic_pub> exited with coredump from signal 6 : ABRT
[Details] warning: 44 ./nptl/pthread_kill.c: No such file or directory
[Details] fmt=fmt@entry=0x7f58e87cf8f0 "%s\n") at ../sysdeps/posix/libc_fatal.c:134
[Details] 2026-09-29 18:55:54: ERROR: writer_my_struct_final_XCDR2 terminated with a signal
[Details] ERROR: my_struct_final_XCDR2 failed
[Details] ERROR: ./Recorder/xtypes_dynamic_recorder timedout
[Details] warning: 57 ./nptl/futex-internal.c: No such file or directory
[Details] 2026-09-29 18:56:11: ERROR: reader_my_struct_appendable_XCDR1 timedout
[Details] ERROR: <./Pub/xtypes_dynamic_pub> exited with coredump from signal 11 : SEGV
[Details] Program terminated with signal SIGSEGV, Segmentation fault.
[Details] 2026-09-29 18:56:13: ERROR: writer_my_struct_appendable_XCDR1 terminated with a signal
[Details] ERROR: my_struct_appendable_XCDR1 failed
[Details] ERROR: ./Recorder/xtypes_dynamic_recorder timedout
[Details] warning: 57 ./nptl/futex-internal.c: No such file or directory
[Details] 2026-09-29 18:56:30: ERROR: reader_my_struct_appendable_XCDR2 timedout
[Details] ERROR: <./Pub/xtypes_dynamic_pub> exited with coredump from signal 11 : SEGV
[Details] Program terminated with signal SIGSEGV, Segmentation fault.
[Details] 2026-09-29 18:56:32: ERROR: writer_my_struct_appendable_XCDR2 terminated with a signal
[Details] ERROR: my_struct_appendable_XCDR2 failed
[Details] ERROR: ./Recorder/xtypes_dynamic_recorder timedout
[Details] warning: 57 ./nptl/futex-internal.c: No such file or directory
[Details] 2026-09-29 18:56:49: ERROR: reader_my_struct_mutable_XCDR1 timedout
[Details] ERROR: <./Pub/xtypes_dynamic_pub> exited with coredump from signal 11 : SEGV
[Details] Program terminated with signal SIGSEGV, Segmentation fault.
[Details] 2026-09-29 18:56:51: ERROR: writer_my_struct_mutable_XCDR1 terminated with a signal
[Details] ERROR: my_struct_mutable_XCDR1 failed
[Details] ERROR: ./Recorder/xtypes_dynamic_recorder timedout
[Details] warning: 57 ./nptl/futex-internal.c: No such file or directory
[Details] 2026-09-29 18:57:08: ERROR: reader_my_struct_mutable_XCDR2 timedout
[Details] ERROR: <./Pub/xtypes_dynamic_pub> exited with coredump from signal 11 : SEGV
[Details] Program terminated with signal SIGSEGV, Segmentation fault.
[Details] 2026-09-29 18:57:10: ERROR: writer_my_struct_mutable_XCDR2 terminated with a signal
[Details] ERROR: my_struct_mutable_XCDR2 failed
[Details] ERROR: ./Recorder/xtypes_dynamic_recorder timedout
[Details] warning: 57 ./nptl/futex-internal.c: No such file or directory
[Details] 2026-09-29 18:57:27: ERROR: reader_outer_struct_final_XCDR1 timedout
[Details] ERROR: <./Pub/xtypes_dynamic_pub> exited with coredump from signal 11 : SEGV
[Details] Program terminated with signal SIGSEGV, Segmentation fault.
[Details] 2026-09-29 18:57:29: ERROR: writer_outer_struct_final_XCDR1 terminated with a signal
[Details] ERROR: outer_struct_final_XCDR1 failed
[Details] ERROR: ./Recorder/xtypes_dynamic_recorder timedout
[Details] warning: 57 ./nptl/futex-internal.c: No such file or directory
[Details] 2026-09-29 18:57:46: ERROR: reader_outer_struct_final_XCDR2 timedout
[Details] ERROR: <./Pub/xtypes_dynamic_pub> exited with coredump from signal 11 : SEGV
[Details] Program terminated with signal SIGSEGV, Segmentation fault.
[Details] 2026-09-29 18:57:48: ERROR: writer_outer_struct_final_XCDR2 terminated with a signal
[Details] ERROR: outer_struct_final_XCDR2 failed
[Details] ERROR: <./Pub/xtypes_dynamic_pub> exited with coredump from signal 11 : SEGV
[Details] Program terminated with signal SIGSEGV, Segmentation fault.
[Details] 2026-09-29 18:57:50: ERROR: writer_outer_struct_appendable_XCDR1 terminated with a signal
[Details] ERROR: outer_struct_appendable_XCDR1 failed
[Details] ERROR: ./Recorder/xtypes_dynamic_recorder timedout
[Details] warning: 57 ./nptl/futex-internal.c: No such file or directory
[Details] 2026-09-29 18:58:08: ERROR: reader_outer_struct_appendable_XCDR2 timedout
[Details] ERROR: <./Pub/xtypes_dynamic_pub> exited with coredump from signal 11 : SEGV
[Details] Program terminated with signal SIGSEGV, Segmentation fault.
[Details] 2026-09-29 18:58:09: ERROR: writer_outer_struct_appendable_XCDR2 terminated with a signal
[Details] ERROR: outer_struct_appendable_XCDR2 failed
[Details] ERROR: ./Recorder/xtypes_dynamic_recorder timedout
[Details] warning: 57 ./nptl/futex-internal.c: No such file or directory
[Details] 2026-09-29 18:58:27: ERROR: reader_outer_struct_mutable_XCDR1 timedout
[Details] ERROR: <./Pub/xtypes_dynamic_pub> exited with coredump from signal 11 : SEGV
[Details] Program terminated with signal SIGSEGV, Segmentation fault.
[Details] 2026-09-29 18:58:28: ERROR: writer_outer_struct_mutable_XCDR1 terminated with a signal
[Details] ERROR: outer_struct_mutable_XCDR1 failed
[Details] ERROR: <./Pub/xtypes_dynamic_pub> exited with coredump from signal 11 : SEGV
[Details] Program terminated with signal SIGSEGV, Segmentation fault.
[Details] 2026-09-29 18:58:30: ERROR: writer_outer_struct_mutable_XCDR2 terminated with a signal
[Details] ERROR: outer_struct_mutable_XCDR2 failed
[Details] ERROR: ./Recorder/xtypes_dynamic_recorder timedout
[Details] warning: 57 ./nptl/futex-internal.c: No such file or directory
[Details] 2026-09-29 18:58:50: ERROR: reader_outer_union_final_XCDR1 timedout
[Details] ERROR: <./Pub/xtypes_dynamic_pub> exited with coredump from signal 6 : ABRT
[Details] warning: 44 ./nptl/pthread_kill.c: No such file or directory
[Details] fmt=fmt@entry=0x7f3b23fcf8f0 "%s\n") at ../sysdeps/posix/libc_fatal.c:134
[Details] 2026-09-29 18:58:52: ERROR: writer_outer_union_final_XCDR1 terminated with a signal
[Details] ERROR: outer_union_final_XCDR1 failed
[Details] ERROR: ./Recorder/xtypes_dynamic_recorder timedout
[Details] warning: 57 ./nptl/futex-internal.c: No such file or directory
[Details] 2026-09-29 18:59:09: ERROR: reader_outer_union_final_XCDR2 timedout
[Details] ERROR: <./Pub/xtypes_dynamic_pub> exited with coredump from signal 6 : ABRT
[Details] warning: 44 ./nptl/pthread_kill.c: No such file or directory
[Details] fmt=fmt@entry=0x7f29129cf8f0 "%s\n") at ../sysdeps/posix/libc_fatal.c:134
[Details] 2026-09-29 18:59:11: ERROR: writer_outer_union_final_XCDR2 terminated with a signal
[Details] ERROR: outer_union_final_XCDR2 failed
[Details] ERROR: ./Recorder/xtypes_dynamic_recorder timedout
[Details] warning: 57 ./nptl/futex-internal.c: No such file or directory
[Details] 2026-09-29 18:59:28: ERROR: reader_outer_union_appendable_XCDR1 timedout
[Details] ERROR: <./Pub/xtypes_dynamic_pub> exited with coredump from signal 6 : ABRT
[Details] warning: 44 ./nptl/pthread_kill.c: No such file or directory
[Details] fmt=fmt@entry=0x7ff1fa7cf8f0 "%s\n") at ../sysdeps/posix/libc_fatal.c:134
[Details] 2026-09-29 18:59:30: ERROR: writer_outer_union_appendable_XCDR1 terminated with a signal
[Details] ERROR: outer_union_appendable_XCDR1 failed
[Details] ERROR: ./Recorder/xtypes_dynamic_recorder timedout
[Details] warning: 57 ./nptl/futex-internal.c: No such file or directory
[Details] 2026-09-29 18:59:47: ERROR: reader_outer_union_appendable_XCDR2 timedout
[Details] ERROR: <./Pub/xtypes_dynamic_pub> exited with coredump from signal 6 : ABRT
[Details] warning: 44 ./nptl/pthread_kill.c: No such file or directory
[Details] fmt=fmt@entry=0x7f9423fcf8f0 "%s\n") at ../sysdeps/posix/libc_fatal.c:134
[Details] 2026-09-29 18:59:49: ERROR: writer_outer_union_appendable_XCDR2 terminated with a signal
[Details] ERROR: outer_union_appendable_XCDR2 failed
[Details] ERROR: ./Recorder/xtypes_dynamic_recorder timedout
[Details] warning: 57 ./nptl/futex-internal.c: No such file or directory
[Details] 2026-09-29 19:00:06: ERROR: reader_outer_union_mutable_XCDR1 timedout
[Details] ERROR: <./Pub/xtypes_dynamic_pub> exited with coredump from signal 6 : ABRT
[Details] warning: 44 ./nptl/pthread_kill.c: No such file or directory
[Details] fmt=fmt@entry=0x7f8ccafcf8f0 "%s\n") at ../sysdeps/posix/libc_fatal.c:134
[Details] 2026-09-29 19:00:08: ERROR: writer_outer_union_mutable_XCDR1 terminated with a signal
[Details] ERROR: outer_union_mutable_XCDR1 failed
[Details] ERROR: ./Recorder/xtypes_dynamic_recorder timedout
[Details] warning: 57 ./nptl/futex-internal.c: No such file or directory
[Details] 2026-09-29 19:00:25: ERROR: reader_outer_union_mutable_XCDR2 timedout
[Details] ERROR: <./Pub/xtypes_dynamic_pub> exited with coredump from signal 6 : ABRT
[Details] warning: 44 ./nptl/pthread_kill.c: No such file or directory
[Details] fmt=fmt@entry=0x7fb4fd3cf8f0 "%s\n") at ../sysdeps/posix/libc_fatal.c:134
[Details] 2026-09-29 19:00:27: ERROR: writer_outer_union_mutable_XCDR2 terminated with a signal
[Details] ERROR: outer_union_mutable_XCDR2 failed
[Details] ERROR: 18 test(s) failed
[Details] auto_run_tests.pl: ERROR: "tests/DCPS/DynamicTypes/run_test.pl" returned with status 1


tests/DCPS/FilterExpression/run_test.pl

OCI_Ubuntu_22_04_Clang22



[Details] ERROR: <FilterExpressionTest> exited with coredump from signal 11 : SEGV
[Details] ERROR: test returned 255
[Details] auto_run_tests.pl: ERROR: "tests/DCPS/FilterExpression/run_test.pl" returned with status 1


tests/DCPS/HelloWorld/CMakeLists.txt run_test.pl

OCI_Ubuntu_22_04_GCC16



[Details] ERROR: waiting for /var/lib/jenkins/workspace/OpenDDS_ACE8_Ubuntu_22_04_GCC16_x64_Debug/bin/DCPSInfoRepo IOR file
[Details] test FAILED (init_error finish_error).
[Details] ERROR: </var/lib/jenkins/workspace/OpenDDS_ACE8_Ubuntu_22_04_GCC16_x64_Debug/bin/DCPSInfoRepo> still running upon object destruction


tests/DCPS/HelloWorld/CMakeLists.txt run_test.pl ini=rtps.ini

OCI_Ubuntu_22_04_GCC16



[Details] 2026-09-23 20:42:07: ERROR: subscriber finished and returned 1
[Details] 2026-09-23 20:42:07: ERROR: publisher finished and returned 1
[Details] test FAILED (success).


tests/DCPS/Messenger/CMakeLists.txt run_test.pl

OCI_Ubuntu_22_04_GCC16



[Details] ERROR: waiting for /var/lib/jenkins/workspace/OpenDDS_ACE8_Ubuntu_22_04_GCC16_x64_Debug/bin/DCPSInfoRepo IOR file
[Details] test FAILED (init_error finish_error).
[Details] ERROR: </var/lib/jenkins/workspace/OpenDDS_ACE8_Ubuntu_22_04_GCC16_x64_Debug/bin/DCPSInfoRepo> still running upon object destruction


tests/DCPS/Messenger/CMakeLists.txt run_test.pl default_tcp

OCI_Ubuntu_22_04_GCC16



[Details] ERROR: waiting for /var/lib/jenkins/workspace/OpenDDS_ACE8_Ubuntu_22_04_GCC16_x64_Debug/bin/DCPSInfoRepo IOR file
[Details] test FAILED (init_error finish_error).
[Details] ERROR: </var/lib/jenkins/workspace/OpenDDS_ACE8_Ubuntu_22_04_GCC16_x64_Debug/bin/DCPSInfoRepo> still running upon object destruction


tests/DCPS/Messenger/CMakeLists.txt run_test.pl nobits

OCI_Ubuntu_22_04_GCC16



[Details] ERROR: waiting for /var/lib/jenkins/workspace/OpenDDS_ACE8_Ubuntu_22_04_GCC16_x64_Debug/bin/DCPSInfoRepo IOR file
[Details] test FAILED (init_error finish_error).
[Details] ERROR: </var/lib/jenkins/workspace/OpenDDS_ACE8_Ubuntu_22_04_GCC16_x64_Debug/bin/DCPSInfoRepo> still running upon object destruction


tests/DCPS/Messenger/CMakeLists.txt run_test.pl rtps

OCI_Ubuntu_22_04_GCC16



[Details] ERROR: waiting for /var/lib/jenkins/workspace/OpenDDS_ACE8_Ubuntu_22_04_GCC16_x64_Debug/bin/DCPSInfoRepo IOR file
[Details] test FAILED (init_error finish_error).
[Details] ERROR: </var/lib/jenkins/workspace/OpenDDS_ACE8_Ubuntu_22_04_GCC16_x64_Debug/bin/DCPSInfoRepo> still running upon object destruction


tests/DCPS/Messenger/CMakeLists.txt run_test.pl rtps_disc

OCI_Ubuntu_22_04_GCC16



[Details] 2026-09-23 20:46:08: ERROR: publisher finished and returned 1
[Details] 2026-09-23 20:46:08: ERROR: subscriber finished and returned 1
[Details] test FAILED (success).


tests/DCPS/Messenger/CMakeLists.txt run_test.pl rtps_disc_half_sec_pub

OCI_Ubuntu_22_04_GCC16



[Details] 2026-09-23 20:46:08: ERROR: publisher finished and returned 1
[Details] 2026-09-23 20:46:08: ERROR: subscriber finished and returned 1
[Details] test FAILED (success).


tests/DCPS/Messenger/CMakeLists.txt run_test.pl rtps_disc_half_sec_sub

OCI_Ubuntu_22_04_GCC16



[Details] 2026-09-23 20:46:08: ERROR: publisher finished and returned 1
[Details] 2026-09-23 20:46:08: ERROR: subscriber finished and returned 1
[Details] test FAILED (success).


tests/DCPS/Messenger/CMakeLists.txt run_test.pl rtps_disc_sec

OCI_Ubuntu_22_04_GCC16



[Details] 2026-09-23 20:46:09: ERROR: publisher finished and returned 1
[Details] 2026-09-23 20:46:09: ERROR: subscriber finished and returned 1
[Details] test FAILED (success).


tests/DCPS/Messenger/CMakeLists.txt run_test.pl rtps_disc_tcp

OCI_Ubuntu_22_04_GCC16



[Details] 2026-09-23 20:46:08: ERROR: publisher finished and returned 1
[Details] 2026-09-23 20:46:08: ERROR: subscriber finished and returned 1
[Details] test FAILED (success).


tests/DCPS/Messenger/CMakeLists.txt run_test.pl rtps_disc_tcp thread_per

OCI_Ubuntu_22_04_GCC16



[Details] 2026-09-23 20:46:08: ERROR: publisher finished and returned 1
[Details] 2026-09-23 20:46:08: ERROR: subscriber finished and returned 1
[Details] test FAILED (success).


tests/DCPS/Messenger/CMakeLists.txt run_test.pl rtps_disc_tcp_udp

OCI_Ubuntu_22_04_GCC16



[Details] 2026-09-23 20:46:08: ERROR: publisher finished and returned 1
[Details] 2026-09-23 20:46:08: ERROR: subscriber finished and returned 1
[Details] test FAILED (success).


tests/DCPS/Messenger/CMakeLists.txt run_test.pl rtps_unicast

OCI_Ubuntu_22_04_GCC16



[Details] ERROR: waiting for /var/lib/jenkins/workspace/OpenDDS_ACE8_Ubuntu_22_04_GCC16_x64_Debug/bin/DCPSInfoRepo IOR file
[Details] test FAILED (init_error finish_error).
[Details] ERROR: </var/lib/jenkins/workspace/OpenDDS_ACE8_Ubuntu_22_04_GCC16_x64_Debug/bin/DCPSInfoRepo> still running upon object destruction


tests/DCPS/Messenger/CMakeLists.txt run_test.pl shmem

OCI_Ubuntu_22_04_GCC16



[Details] ERROR: waiting for /var/lib/jenkins/workspace/OpenDDS_ACE8_Ubuntu_22_04_GCC16_x64_Debug/bin/DCPSInfoRepo IOR file
[Details] test FAILED (init_error finish_error).
[Details] ERROR: </var/lib/jenkins/workspace/OpenDDS_ACE8_Ubuntu_22_04_GCC16_x64_Debug/bin/DCPSInfoRepo> still running upon object destruction


tests/DCPS/Messenger/CMakeLists.txt run_test.pl stack

OCI_Ubuntu_22_04_GCC16



[Details] ERROR: waiting for /var/lib/jenkins/workspace/OpenDDS_ACE8_Ubuntu_22_04_GCC16_x64_Debug/bin/DCPSInfoRepo IOR file
[Details] test FAILED (init_error finish_error).
[Details] ERROR: </var/lib/jenkins/workspace/OpenDDS_ACE8_Ubuntu_22_04_GCC16_x64_Debug/bin/DCPSInfoRepo> still running upon object destruction


tests/DCPS/Messenger/CMakeLists.txt run_test.pl thread_per

OCI_Ubuntu_22_04_GCC16



[Details] ERROR: waiting for /var/lib/jenkins/workspace/OpenDDS_ACE8_Ubuntu_22_04_GCC16_x64_Debug/bin/DCPSInfoRepo IOR file
[Details] test FAILED (init_error finish_error).
[Details] ERROR: </var/lib/jenkins/workspace/OpenDDS_ACE8_Ubuntu_22_04_GCC16_x64_Debug/bin/DCPSInfoRepo> still running upon object destruction


tests/DCPS/QueryCondition/run_test.pl rtps_disc dynamic

OCI_Ubuntu_22_04_Clang22



[Details] ERROR: <QueryConditionTest> exited with coredump from signal 11 : SEGV
[Details] ERROR: test returned 255
[Details] auto_run_tests.pl: ERROR: "tests/DCPS/QueryCondition/run_test.pl rtps_disc dynamic" returned with status 1


tests/DCPS/XTypes/run_test.pl --dynamic-readers

OCI_Ubuntu_22_04_Clang22



[Details] 2026-09-23 23:07:01: ERROR: reader_PlainCdr finished and returned 1
[Details] 2026-09-23 23:07:11: ERROR: writer_PlainCdr finished and returned 1
[Details] ERROR: check_int32: resolve_string_path: Error
[Details] ERROR: check_int32 for PlainCdrStruct.key_field failed
[Details] ERROR: read_i: wait failed: Timeout
[Details] ERROR: control read failed
[Details] test FAILED (process_error).
[Details] 2026-09-23 23:07:12: ERROR: reader_IgnoreMemberNames_MutableStructMatch finished and returned 1
[Details] 2026-09-23 23:07:21: ERROR: writer_IgnoreMemberNames_MutableStructMatch finished and returned 1
[Details] ERROR: check_int32: resolve_string_path: Error
[Details] ERROR: check_int32 for MutableStruct.key_field failed
[Details] ERROR: check_int32: resolve_string_path: Error
[Details] ERROR: check_int32 for MutableStruct.additional_field failed
[Details] ERROR: read_i: wait failed: Timeout
[Details] ERROR: control read failed
[Details] test FAILED (process_error).
[Details] 2026-09-23 23:07:22: ERROR: reader_DisallowTypeCoercion_FinalStructMatch finished and returned 1
[Details] 2026-09-23 23:07:32: ERROR: writer_DisallowTypeCoercion_FinalStructMatch finished and returned 1
[Details] ERROR: check_int32: resolve_string_path: Error
[Details] ERROR: check_int32 for FinalStructSub.key_field failed
[Details] ERROR: read_i: wait failed: Timeout
[Details] ERROR: control read failed
[Details] test FAILED (process_error).
[Details] 2026-09-23 23:07:33: ERROR: reader_MutableUnion finished and returned 1
[Details] 2026-09-23 23:07:42: ERROR: writer_MutableUnion finished and returned 1
[Details] ERROR: check_int32: resolve_string_path: Error
[Details] ERROR: check_int32 for MutableUnion.discriminator failed
[Details] ERROR: read_i: wait failed: Timeout
[Details] ERROR: control read failed
[Details] test FAILED (process_error).
[Details] 2026-09-23 23:07:46: ERROR: reader_FinalStructMatch finished and returned 1
[Details] 2026-09-23 23:07:56: ERROR: writer_FinalStructMatch finished and returned 1
[Details] ERROR: check_int32: resolve_string_path: Error
[Details] ERROR: check_int32 for FinalStructSub.key_field failed
[Details] ERROR: read_i: wait failed: Timeout
[Details] ERROR: control read failed
[Details] test FAILED (process_error).
[Details] 2026-09-23 23:07:57: ERROR: reader_AppendableMatch finished and returned 1
[Details] 2026-09-23 23:08:06: ERROR: writer_AppendableMatch finished and returned 1
[Details] ERROR: check_int32: resolve_string_path: Error
[Details] ERROR: check_int32 for AppendableStruct.key_field failed
[Details] ERROR: read_i: wait failed: Timeout
[Details] ERROR: control read failed
[Details] test FAILED (process_error).
[Details] 2026-09-23 23:08:11: ERROR: reader_Match_no_xtypes_yn finished and returned 1
[Details] 2026-09-23 23:08:20: ERROR: writer_Match_no_xtypes_yn finished and returned 1
[Details] ERROR: check_int32: resolve_string_path: Error
[Details] ERROR: check_int32 for AppendableStructNoXTypes.key_field failed
[Details] ERROR: read_i: wait failed: Timeout
[Details] ERROR: control read failed
[Details] test FAILED (process_error).
[Details] 2026-09-23 23:08:23: ERROR: reader_MutableStruct finished and returned 1
[Details] 2026-09-23 23:08:33: ERROR: writer_MutableStruct finished and returned 1
[Details] ERROR: check_int32: resolve_string_path: Error
[Details] ERROR: check_int32 for MutableStruct.key_field failed
[Details] ERROR: check_int32: resolve_string_path: Error
[Details] ERROR: check_int32 for MutableStruct.additional_field failed
[Details] ERROR: read_i: wait failed: Timeout
[Details] ERROR: control read failed
[Details] test FAILED (process_error).
[Details] 2026-09-23 23:08:36: ERROR: reader_NoXTypesMatchTypeNames finished and returned 1
[Details] 2026-09-23 23:08:45: ERROR: writer_NoXTypesMatchTypeNames finished and returned 1
[Details] ERROR: check_int32: resolve_string_path: Error
[Details] ERROR: check_int32 for AppendableStructNoXTypes.key_field failed
[Details] ERROR: read_i: wait failed: Timeout
[Details] ERROR: control read failed
[Details] test FAILED (process_error).
[Details] 2026-09-23 23:08:48: ERROR: reader_Dependency finished and returned 1
[Details] 2026-09-23 23:08:58: ERROR: writer_Dependency finished and returned 1
[Details] ERROR: check_int32: resolve_string_path: Error
[Details] ERROR: check_int32 for AppendableStruct.key_field failed
[Details] ERROR: read_i: wait failed: Timeout
[Details] ERROR: control read failed
[Details] test FAILED (process_error).
[Details] 2026-09-23 23:09:00: ERROR: reader_Match_no_xtypes_ny finished and returned 1
[Details] 2026-09-23 23:09:10: ERROR: writer_Match_no_xtypes_ny finished and returned 1
[Details] ERROR: check_int32: resolve_string_path: Error
[Details] ERROR: check_int32 for AppendableStructNoXTypes.key_field failed
[Details] ERROR: read_i: wait failed: Timeout
[Details] ERROR: control read failed
[Details] test FAILED (process_error).
[Details] 2026-09-23 23:09:11: ERROR: reader_IgnoreMemberNames_MutableUnionMatch finished and returned 1
[Details] 2026-09-23 23:09:21: ERROR: writer_IgnoreMemberNames_MutableUnionMatch finished and returned 1
[Details] ERROR: check_int32: resolve_string_path: Error
[Details] ERROR: check_int32 for MutableUnion.discriminator failed
[Details] ERROR: read_i: wait failed: Timeout
[Details] ERROR: control read failed
[Details] test FAILED (process_error).
[Details] 2026-09-23 23:09:26: ERROR: reader_Match_no_xtypes_nn finished and returned 1
[Details] 2026-09-23 23:09:36: ERROR: writer_Match_no_xtypes_nn finished and returned 1
[Details] ERROR: check_int32: resolve_string_path: Error
[Details] ERROR: check_int32 for AppendableStructNoXTypes.key_field failed
[Details] ERROR: read_i: wait failed: Timeout
[Details] ERROR: control read failed
[Details] test FAILED (process_error).
[Details] auto_run_tests.pl: ERROR: "tests/DCPS/XTypes/run_test.pl --dynamic-readers" returned with status 1


tests/DCPS/XTypes/run_test.pl --dynamic-writers

OCI_Ubuntu_22_04_Clang22



[Details] 2026-09-23 23:02:59: ERROR: reader_Match_no_xtypes_yn finished and returned 1
[Details] 2026-09-23 23:02:59: ERROR: writer_Match_no_xtypes_yn finished and returned 1
[Details] ERROR: read_i: wait failed: Timeout
[Details] ERROR: read_single AppendableStructNoXTypes failed
[Details] ERROR: wait on control_dw condition returned Timeout
[Details] ERROR: set_int32: resolve_string_path: Error
[Details] ERROR: read_i: wait failed: Timeout
[Details] ERROR: control read failed
[Details] test FAILED (process_error).
[Details] 2026-09-23 23:03:15: ERROR: reader_Tryconstruct finished and returned 1
[Details] 2026-09-23 23:03:15: ERROR: writer_Tryconstruct finished and returned 1
[Details] ERROR: read_i: wait failed: Timeout
[Details] ERROR: read_single Trim20Struct failed
[Details] ERROR: wait on control_dw condition returned Timeout
[Details] ERROR: set_string: resolve_string_path: Error
[Details] ERROR: read_i: wait failed: Timeout
[Details] ERROR: control read failed
[Details] test FAILED (process_error).
[Details] 2026-09-23 23:03:26: ERROR: reader_MutableUnion finished and returned 1
[Details] 2026-09-23 23:03:26: ERROR: writer_MutableUnion finished and returned 1
[Details] ERROR: read_i: wait failed: Timeout
[Details] ERROR: read_single MutableUnion failed
[Details] ERROR: check_int32 for MutableUnion.key_field: expected 103, received 0
[Details] ERROR: set_int32: resolve_string_path: Error
[Details] ERROR: read_i: wait failed: Timeout
[Details] ERROR: control read failed
[Details] test FAILED (process_error).
[Details] 2026-09-23 23:03:36: ERROR: reader_IgnoreMemberNames_MutableUnionMatch finished and returned 1
[Details] 2026-09-23 23:03:36: ERROR: writer_IgnoreMemberNames_MutableUnionMatch finished and returned 1
[Details] ERROR: read_i: wait failed: Timeout
[Details] ERROR: read_single MutableUnion failed
[Details] ERROR: check_int32 for MutableUnion.key_field: expected 104, received 0
[Details] ERROR: set_int32: resolve_string_path: Error
[Details] ERROR: read_i: wait failed: Timeout
[Details] ERROR: control read failed
[Details] test FAILED (process_error).
[Details] 2026-09-23 23:03:53: ERROR: reader_FinalStructMatch finished and returned 1
[Details] 2026-09-23 23:03:53: ERROR: writer_FinalStructMatch finished and returned 1
[Details] ERROR: read_i: wait failed: Timeout
[Details] ERROR: read_single FinalStructSub failed
[Details] ERROR: wait on control_dw condition returned Timeout
[Details] ERROR: set_int32: resolve_string_path: Error
[Details] ERROR: read_i: wait failed: Timeout
[Details] ERROR: control read failed
[Details] test FAILED (process_error).
[Details] 2026-09-23 23:04:10: ERROR: reader_ExtendedMutableStructMatch finished and returned 1
[Details] 2026-09-23 23:04:10: ERROR: writer_ExtendedMutableStructMatch finished and returned 1
[Details] ERROR: read_i: wait failed: Timeout
[Details] ERROR: read_single MutableStruct failed
[Details] ERROR: wait on control_dw condition returned Timeout
[Details] ERROR: set_int32: resolve_string_path: Error
[Details] ERROR: read_i: wait failed: Timeout
[Details] ERROR: control read failed
[Details] test FAILED (process_error).
[Details] 2026-09-23 23:04:26: ERROR: reader_Match_no_xtypes_ny finished and returned 1
[Details] 2026-09-23 23:04:26: ERROR: writer_Match_no_xtypes_ny finished and returned 1
[Details] ERROR: read_i: wait failed: Timeout
[Details] ERROR: read_single AppendableStructNoXTypes failed
[Details] ERROR: wait on control_dw condition returned Timeout
[Details] ERROR: set_int32: resolve_string_path: Error
[Details] ERROR: read_i: wait failed: Timeout
[Details] ERROR: control read failed
[Details] test FAILED (process_error).
[Details] 2026-09-23 23:04:41: ERROR: reader_Match_no_xtypes_nn finished and returned 1
[Details] 2026-09-23 23:04:41: ERROR: writer_Match_no_xtypes_nn finished and returned 1
[Details] ERROR: read_i: wait failed: Timeout
[Details] ERROR: read_single AppendableStructNoXTypes failed
[Details] ERROR: wait on control_dw condition returned Timeout
[Details] ERROR: set_int32: resolve_string_path: Error
[Details] ERROR: read_i: wait failed: Timeout
[Details] ERROR: control read failed
[Details] test FAILED (process_error).
[Details] 2026-09-23 23:04:58: ERROR: reader_IgnoreMemberNames_MutableStructMatch finished and returned 1
[Details] 2026-09-23 23:04:58: ERROR: writer_IgnoreMemberNames_MutableStructMatch finished and returned 1
[Details] ERROR: read_i: wait failed: Timeout
[Details] ERROR: read_single MutableStruct failed
[Details] ERROR: wait on control_dw condition returned Timeout
[Details] ERROR: set_int32: resolve_string_path: Error
[Details] ERROR: set_int32: resolve_string_path: Error
[Details] ERROR: read_i: wait failed: Timeout
[Details] ERROR: control read failed
[Details] test FAILED (process_error).
[Details] 2026-09-23 23:05:18: ERROR: reader_PlainCdr finished and returned 1
[Details] 2026-09-23 23:05:18: ERROR: writer_PlainCdr finished and returned 1
[Details] ERROR: read_i: wait failed: Timeout
[Details] ERROR: read_single PlainCdrStruct failed
[Details] ERROR: wait on control_dw condition returned Timeout
[Details] ERROR: set_int32: resolve_string_path: Error
[Details] ERROR: set_int32: resolve_string_path: Error
[Details] ERROR: read_i: wait failed: Timeout
[Details] ERROR: control read failed
[Details] test FAILED (process_error).
[Details] 2026-09-23 23:05:37: ERROR: reader_MutableStruct finished and returned 1
[Details] 2026-09-23 23:05:37: ERROR: writer_MutableStruct finished and returned 1
[Details] ERROR: read_i: wait failed: Timeout
[Details] ERROR: read_single MutableStruct failed
[Details] ERROR: wait on control_dw condition returned Timeout
[Details] ERROR: set_int32: resolve_string_path: Error
[Details] ERROR: set_int32: resolve_string_path: Error
[Details] ERROR: read_i: wait failed: Timeout
[Details] ERROR: control read failed
[Details] test FAILED (process_error).
[Details] 2026-09-23 23:05:52: ERROR: reader_ExtendedAppendableMatch finished and returned 1
[Details] 2026-09-23 23:05:52: ERROR: writer_ExtendedAppendableMatch finished and returned 1
[Details] ERROR: read_i: wait failed: Timeout
[Details] ERROR: read_single ExtendedAppendableStruct failed
[Details] ERROR: wait on control_dw condition returned Timeout
[Details] ERROR: set_int32: resolve_string_path: Error
[Details] ERROR: read_i: wait failed: Timeout
[Details] ERROR: control read failed
[Details] test FAILED (process_error).
[Details] 2026-09-23 23:06:08: ERROR: reader_DisallowTypeCoercion_FinalStructMatch finished and returned 1
[Details] 2026-09-23 23:06:08: ERROR: writer_DisallowTypeCoercion_FinalStructMatch finished and returned 1
[Details] ERROR: read_i: wait failed: Timeout
[Details] ERROR: read_single FinalStructSub failed
[Details] ERROR: wait on control_dw condition returned Timeout
[Details] ERROR: set_int32: resolve_string_path: Error
[Details] ERROR: read_i: wait failed: Timeout
[Details] ERROR: control read failed
[Details] test FAILED (process_error).
[Details] 2026-09-23 23:06:24: ERROR: reader_NoXTypesMatchTypeNames finished and returned 1
[Details] 2026-09-23 23:06:24: ERROR: writer_NoXTypesMatchTypeNames finished and returned 1
[Details] ERROR: read_i: wait failed: Timeout
[Details] ERROR: read_single AppendableStructNoXTypes failed
[Details] ERROR: wait on control_dw condition returned Timeout
[Details] ERROR: set_int32: resolve_string_path: Error
[Details] ERROR: read_i: wait failed: Timeout
[Details] ERROR: control read failed
[Details] test FAILED (process_error).
[Details] 2026-09-23 23:06:40: ERROR: reader_AppendableMatch finished and returned 1
[Details] 2026-09-23 23:06:40: ERROR: writer_AppendableMatch finished and returned 1
[Details] ERROR: read_i: wait failed: Timeout
[Details] ERROR: read_single AppendableStruct failed
[Details] ERROR: wait on control_dw condition returned Timeout
[Details] ERROR: set_int32: resolve_string_path: Error
[Details] ERROR: set_int32: resolve_string_path: Error
[Details] ERROR: read_i: wait failed: Timeout
[Details] ERROR: control read failed
[Details] test FAILED (process_error).
[Details] 2026-09-23 23:06:58: ERROR: reader_Dependency finished and returned 1
[Details] 2026-09-23 23:06:58: ERROR: writer_Dependency finished and returned 1
[Details] ERROR: read_i: wait failed: Timeout
[Details] ERROR: read_single AppendableStruct failed
[Details] ERROR: wait on control_dw condition returned Timeout
[Details] ERROR: set_int32: resolve_string_path: Error
[Details] ERROR: set_int32: resolve_string_path: Error
[Details] ERROR: read_i: wait failed: Timeout
[Details] ERROR: control read failed
[Details] test FAILED (process_error).
[Details] auto_run_tests.pl: ERROR: "tests/DCPS/XTypes/run_test.pl --dynamic-writers" returned with status 1


tests/DCPS/XTypes/run_test.pl --dynamic-writers --dynamic-readers

OCI_Ubuntu_22_04_Clang22



[Details] 2026-09-23 23:09:53: ERROR: reader_PlainCdr finished and returned 1
[Details] 2026-09-23 23:09:53: ERROR: writer_PlainCdr finished and returned 1
[Details] ERROR: read_i: wait failed: Timeout
[Details] ERROR: read_single PlainCdrStruct failed
[Details] ERROR: wait on control_dw condition returned Timeout
[Details] ERROR: set_int32: resolve_string_path: Error
[Details] ERROR: set_int32: resolve_string_path: Error
[Details] ERROR: read_i: wait failed: Timeout
[Details] ERROR: control read failed
[Details] test FAILED (process_error).
[Details] 2026-09-23 23:10:04: ERROR: reader_IgnoreMemberNames_MutableUnionMatch finished and returned 1
[Details] 2026-09-23 23:10:04: ERROR: writer_IgnoreMemberNames_MutableUnionMatch finished and returned 1
[Details] ERROR: read_i: wait failed: Timeout
[Details] ERROR: read_single MutableUnion failed
[Details] ERROR: check_int32 for MutableUnion.key_field failed
[Details] ERROR: set_int32: resolve_string_path: Error
[Details] ERROR: read_i: wait failed: Timeout
[Details] ERROR: control read failed
[Details] test FAILED (process_error).
[Details] ERROR: set_int32: resolve_string_path: Error
[Details] test FAILED (success).
[Details] 2026-09-23 23:10:21: ERROR: reader_IgnoreMemberNames_MutableStructMatch finished and returned 1
[Details] 2026-09-23 23:10:21: ERROR: writer_IgnoreMemberNames_MutableStructMatch finished and returned 1
[Details] ERROR: read_i: wait failed: Timeout
[Details] ERROR: read_single MutableStruct failed
[Details] ERROR: wait on control_dw condition returned Timeout
[Details] ERROR: set_int32: resolve_string_path: Error
[Details] ERROR: set_int32: resolve_string_path: Error
[Details] ERROR: read_i: wait failed: Timeout
[Details] ERROR: control read failed
[Details] test FAILED (process_error).
[Details] 2026-09-23 23:10:38: ERROR: reader_AppendableMatch finished and returned 1
[Details] 2026-09-23 23:10:38: ERROR: writer_AppendableMatch finished and returned 1
[Details] ERROR: read_i: wait failed: Timeout
[Details] ERROR: read_single AppendableStruct failed
[Details] ERROR: wait on control_dw condition returned Timeout
[Details] ERROR: set_int32: resolve_string_path: Error
[Details] ERROR: set_int32: resolve_string_path: Error
[Details] ERROR: read_i: wait failed: Timeout
[Details] ERROR: control read failed
[Details] test FAILED (process_error).
[Details] ERROR: set_int32: resolve_string_path: Error
[Details] test FAILED (success).
[Details] 2026-09-23 23:10:59: ERROR: reader_FinalStructMatch finished and returned 1
[Details] 2026-09-23 23:10:59: ERROR: writer_FinalStructMatch finished and returned 1
[Details] ERROR: read_i: wait failed: Timeout
[Details] ERROR: read_single FinalStructSub failed
[Details] ERROR: wait on control_dw condition returned Timeout
[Details] ERROR: set_int32: resolve_string_path: Error
[Details] ERROR: read_i: wait failed: Timeout
[Details] ERROR: control read failed
[Details] test FAILED (process_error).
[Details] 2026-09-23 23:11:16: ERROR: reader_DisallowTypeCoercion_FinalStructMatch finished and returned 1
[Details] 2026-09-23 23:11:16: ERROR: writer_DisallowTypeCoercion_FinalStructMatch finished and returned 1
[Details] ERROR: read_i: wait failed: Timeout
[Details] ERROR: read_single FinalStructSub failed
[Details] ERROR: wait on control_dw condition returned Timeout
[Details] ERROR: set_int32: resolve_string_path: Error
[Details] ERROR: read_i: wait failed: Timeout
[Details] ERROR: control read failed
[Details] test FAILED (process_error).
[Details] 2026-09-23 23:11:32: ERROR: reader_Match_no_xtypes_yn finished and returned 1
[Details] 2026-09-23 23:11:32: ERROR: writer_Match_no_xtypes_yn finished and returned 1
[Details] ERROR: read_i: wait failed: Timeout
[Details] ERROR: read_single AppendableStructNoXTypes failed
[Details] ERROR: wait on control_dw condition returned Timeout
[Details] ERROR: set_int32: resolve_string_path: Error
[Details] ERROR: read_i: wait failed: Timeout
[Details] ERROR: control read failed
[Details] test FAILED (process_error).
[Details] ERROR: set_string: resolve_string_path: Error
[Details] test FAILED (success).
[Details] 2026-09-23 23:11:51: ERROR: reader_Dependency finished and returned 1
[Details] 2026-09-23 23:11:51: ERROR: writer_Dependency finished and returned 1
[Details] ERROR: read_i: wait failed: Timeout
[Details] ERROR: read_single AppendableStruct failed
[Details] ERROR: wait on control_dw condition returned Timeout
[Details] ERROR: set_int32: resolve_string_path: Error
[Details] ERROR: set_int32: resolve_string_path: Error
[Details] ERROR: read_i: wait failed: Timeout
[Details] ERROR: control read failed
[Details] test FAILED (process_error).
[Details] 2026-09-23 23:12:06: ERROR: reader_MutableStruct finished and returned 1
[Details] 2026-09-23 23:12:06: ERROR: writer_MutableStruct finished and returned 1
[Details] ERROR: read_i: wait failed: Timeout
[Details] ERROR: read_single MutableStruct failed
[Details] ERROR: wait on control_dw condition returned Timeout
[Details] ERROR: set_int32: resolve_string_path: Error
[Details] ERROR: set_int32: resolve_string_path: Error
[Details] ERROR: read_i: wait failed: Timeout
[Details] ERROR: control read failed
[Details] test FAILED (process_error).
[Details] 2026-09-23 23:12:17: ERROR: reader_MutableUnion finished and returned 1
[Details] 2026-09-23 23:12:17: ERROR: writer_MutableUnion finished and returned 1
[Details] ERROR: read_i: wait failed: Timeout
[Details] ERROR: read_single MutableUnion failed
[Details] ERROR: check_int32 for MutableUnion.key_field failed
[Details] ERROR: set_int32: resolve_string_path: Error
[Details] ERROR: read_i: wait failed: Timeout
[Details] ERROR: control read failed
[Details] test FAILED (process_error).
[Details] 2026-09-23 23:12:33: ERROR: reader_NoXTypesMatchTypeNames finished and returned 1
[Details] 2026-09-23 23:12:33: ERROR: writer_NoXTypesMatchTypeNames finished and returned 1
[Details] ERROR: read_i: wait failed: Timeout
[Details] ERROR: read_single AppendableStructNoXTypes failed
[Details] ERROR: wait on control_dw condition returned Timeout
[Details] ERROR: set_int32: resolve_string_path: Error
[Details] ERROR: read_i: wait failed: Timeout
[Details] ERROR: control read failed
[Details] test FAILED (process_error).
[Details] 2026-09-23 23:12:51: ERROR: reader_Match_no_xtypes_nn finished and returned 1
[Details] 2026-09-23 23:12:51: ERROR: writer_Match_no_xtypes_nn finished and returned 1
[Details] ERROR: read_i: wait failed: Timeout
[Details] ERROR: read_single AppendableStructNoXTypes failed
[Details] ERROR: wait on control_dw condition returned Timeout
[Details] ERROR: set_int32: resolve_string_path: Error
[Details] ERROR: read_i: wait failed: Timeout
[Details] ERROR: control read failed
[Details] test FAILED (process_error).
[Details] 2026-09-23 23:13:08: ERROR: reader_Match_no_xtypes_ny finished and returned 1
[Details] 2026-09-23 23:13:08: ERROR: writer_Match_no_xtypes_ny finished and returned 1
[Details] ERROR: read_i: wait failed: Timeout
[Details] ERROR: read_single AppendableStructNoXTypes failed
[Details] ERROR: wait on control_dw condition returned Timeout
[Details] ERROR: set_int32: resolve_string_path: Error
[Details] ERROR: read_i: wait failed: Timeout
[Details] ERROR: control read failed
[Details] test FAILED (process_error).
[Details] auto_run_tests.pl: ERROR: "tests/DCPS/XTypes/run_test.pl --dynamic-writers --dynamic-readers" returned with status 1


tests/DCPS/ZeroEnum/run_test.pl

OCI_Ubuntu_22_04_Clang22



[Details] ERROR: <subscriber> exited with coredump from signal 6 : ABRT
[Details] 2026-09-23 23:23:18: ERROR: subscriber terminated with a signal
[Details] ERROR: publisher timedout
[Details] 78 ../sysdeps/unix/sysv/linux/clock_nanosleep.c: No such file or directory.
[Details] 2026-09-23 23:23:48: ERROR: publisher timedout
[Details] ERROR: TEST could get dynamic type member for my_enum
[Details] test FAILED (success).
[Details] auto_run_tests.pl: ERROR: "tests/DCPS/ZeroEnum/run_test.pl" returned with status 4


tests/cmake/Messenger/Messenger_1/CMakeLists.txt run_test.pl

OCI_Ubuntu_22_04_GCC16



[Details] ERROR: waiting for /var/lib/jenkins/workspace/OpenDDS_ACE8_Ubuntu_22_04_GCC16_x64_Debug/bin/DCPSInfoRepo IOR file
[Details] test FAILED (init_error finish_error).
[Details] ERROR: </var/lib/jenkins/workspace/OpenDDS_ACE8_Ubuntu_22_04_GCC16_x64_Debug/bin/DCPSInfoRepo> still running upon object destruction


tests/cmake/Nested_IDL/CMakeLists.txt run_test.pl

OCI_Ubuntu_22_04_GCC16



[Details] 2026-09-23 20:41:20: ERROR: main finished and returned 1
[Details] test FAILED (success).


tests/cmake/ace_tao_only/CMakeLists.txt run_test.pl

OCI_Ubuntu_22_04_GCC16



[Details] ERROR: cannot find file </var/lib/jenkins/workspace/OpenDDS_ACE8_Ubuntu_22_04_GCC16_x64_Debug/build/tests/cmake/ace_tao_only/Messenger.ior>


tests/cmake/install/CMakeLists.txt run_test.pl

OCI_Ubuntu_22_04_GCC16



[Details] 2026-09-23 20:41:36: ERROR: user finished and returned 1
[Details] test FAILED (success).


tests/security/CheckInstance/run_test.pl

OCI_Ubuntu_22_04_Clang22



[Details] 2026-09-23 23:32:16: ERROR: CheckInstance finished and returned 1
[Details] 2026-09-23 23:32:16.060@LM_ERROR@ERROR: check_local_datawriter_register_instance did not allow an instance to be registered when expected
[Details] test FAILED (success).
[Details] ERROR: test returned 4
[Details] auto_run_tests.pl: ERROR: "tests/security/CheckInstance/run_test.pl" returned with status 1


tests/unit-tests/run_test.pl

OCI_Ubuntu_22_04_Clang22



[Details] [ FAILED ] dds_DCPS_XTypes_DynamicDataImpl.Mutable_WriteRecursiveStruct (0 ms)
[Details] [ FAILED ] dds_DCPS_XTypes_DynamicDataImpl.Mutable_WriteKeyOnly (0 ms)
[Details] [ FAILED ] dds_DCPS_XTypes_DynamicDataImpl.Nested_WriteKeyOnly (0 ms)
[Details] [ FAILED ] dds_DCPS_XTypes_DynamicDataImpl.String_As_Enum (0 ms)
[Details] (161916|161916) ERROR: dynamic_data_json: unknown member id in XmlTypeProviderTest::Sample at $
[Details] (161916|161916) ERROR: dynamic_data_json: failed to populate DynamicData for XmlTypeProviderTest::Sample
[Details] ERROR: <UnitTests> exited with coredump from signal 11 : SEGV
[Details] 2026-09-23 22:18:54: ERROR: UnitTests terminated with a signal
[Details] test FAILED (success).
[Details] auto_run_tests.pl: ERROR: "tests/unit-tests/run_test.pl" returned with status 1